{"text_format":"1","workbook":"xlsx","n_sheets":13,"sheets":["Instructions","Plant setup","Production data","Incoming water","mix vs WU","Non-returnable Lines","Glass Lines","CIP","Utilities +WTP","Water Balance","Output-Tier 1&2","Cans","AWS requirement"],"not_rendered":{"charts":7,"images":22,"macros":0,"external_links":2,"defined_names":10,"comments":7,"pivot_tables":0},"unopened":[],"bounds":{"document_bytes":16777216,"sheet_cells":100000,"rows_first":2000,"rows_last":500,"rows_between":2000,"halvings":0,"cell_chars":16384,"cell_head_chars":4096},"cells_cut":0,"cells_raw":0,"read":"whole","date_system":"1900"}

{"sheet":"Instructions","index":0,"n_rows":31,"n_cols":3,"rows_kept":31,"cut":false,"hidden":false,"merged":[[29,0,29,6],[30,0,30,6],[9,0,9,15],[11,0,13,14],[25,0,25,6],[26,0,26,6],[27,0,27,6],[28,0,28,6]]}
[]
[]
[]
[]
[]
[]
[]
[]
[]
["Water Profiler - Beverage"]
{"$rows_left_out":22}
{"sheet":"Plant setup","index":1,"n_rows":26,"n_cols":21,"rows_kept":26,"cut":false,"hidden":false,"merged":[[24,0,24,10],[10,0,10,19]]}
["Divisions"]
["BU"]
["Country"]
["Site Name"]
["Site Plant Manager"]
["BU Sustainability Lead"]
["Year of Profile"]
["Site Product Type"]
["No of Production Lines"]
[null,1,2,3,4,5,6,7,8,9,10,11,12,13,14,15,16,17,18,19]
{"$rows_left_out":17}
{"sheet":"Production data","index":2,"n_rows":206,"n_cols":15,"rows_kept":206,"cut":false,"hidden":false,"merged":[[0,1,0,11]]}
[null,"Production data by line by pack by month"]
[]
[null,"Line category","Line Code","Line number\n(Line1)","Pack type\n(PET, Cans…etc)","Product Type\n(CSD/NCB/BW)","Pack size\n(Can-330ml)","Month","Production (Liters)","NE%","Hrs NE","rated speed\nL/hr",null,"Monthly figures"]
[{"$f":"IF(I4>0,IF(B4=B3,A3,A3+1),\"\")","v":""},{"$f":"D4&\"-\"&E4","v":"-"},{"$f":"IF(I4>0,D4&\"-\"&F4&\"-\"&G4,\"\")","v":""},null,null,null,null,null,null,null,null,null,null,"Jan",{"$f":"SUMIF($H$4:$I$123,\"january\",$I$4:$I$123)","v":0}]
["",{"$f":"D5&\"-\"&E5","v":"-"},{"$f":"IF(I5>0,D5&\"-\"&F5&\"-\"&G5,\"\")","v":""},null,null,null,null,null,null,null,null,null,null,"feb",{"$f":"SUMIF($H$4:$I$123,\"February\",$I$4:$I$123)","v":0}]
["","-","",null,null,null,null,null,null,null,null,null,null,"Mar",{"$f":"SUMIF($H$4:$I$123,\"March\",$I$4:$I$123)","v":0}]
["","-","",null,null,null,null,null,null,null,null,null,null,"Apr",{"$f":"SUMIF($H$4:$I$123,\"April\",$I$4:$I$123)","v":0}]
["","-","",null,null,null,null,null,null,null,null,null,null,"May",{"$f":"SUMIF($H$4:$I$123,\"May\",$I$4:$I$123)","v":0}]
["","-","",null,null,null,null,null,null,null,null,null,null,"Jun",{"$f":"SUMIF($H$4:$I$123,\"hune\",$I$4:$I$123)","v":0}]
["","-","",null,null,null,null,null,null,null,null,null,null,"Jul",{"$f":"SUMIF($H$4:$I$123,\"huly\",$I$4:$I$123)","v":0}]
{"$rows_left_out":197}
{"sheet":"Incoming water","index":3,"n_rows":33,"n_cols":15,"rows_kept":33,"cut":false,"hidden":false,"merged":[[4,8,4,14],[19,8,19,14],[19,0,19,4],[0,0,0,14],[2,8,2,9],[4,0,4,6],[2,4,2,5]]}
["Site Incoming & Outgoing Water Data"]
[]
[{"$f":"'Plant setup'!B4","v":0},"Year",{"$f":"'Plant setup'!B7","v":0},null,"Cost of Raw Water $/m3",null,null,null,"Cost of treated Water $/m3"]
[]
["Incoming Water Usage",null,null,null,null,null,null,null,"WasteWater Effluent Discharge from WWTP on site"]
["Source Type","Month","Year","Water Used m3","Purchase Cost","production Liters","WUR",null,"Month","Year","Treated Effluent Discharged m3","Effluent BOD","Effluent COD","Effluent TSS","Effluent pH"]
[null,"Jan",{"$f":"$C$3","v":0},null,{"$f":"D7*$G$3","v":0},{"$f":"VLOOKUP(B7,'Production data'!$N$4:$O$15,2,0)","v":0},{"$f":"IFERROR(D7*1000/F7,0)","v":0},null,"Jan",{"$f":"$C$3","v":0}]
[null,"feb",0,null,0,{"$f":"VLOOKUP(B8,'Production data'!$N$4:$O$15,2,0)","v":0},{"$f":"IFERROR(D8*1000/F8,0)","v":0},null,"Feb",0]
[null,"Mar",0,null,0,{"$f":"VLOOKUP(B9,'Production data'!$N$4:$O$15,2,0)","v":0},0,null,"Mar",0]
[null,"Apr",0,null,0,{"$f":"VLOOKUP(B10,'Production data'!$N$4:$O$15,2,0)","v":0},0,null,"Apr",0]
{"$rows_left_out":24}
{"sheet":"mix vs WU","index":4,"n_rows":12,"n_cols":18,"rows_kept":12,"cut":false,"hidden":true,"merged":[]}
[null,"cans","PET CSD","PET HF","AF","RB","NRGB","WU (L/L) actual","WU (L/L) calculated",null,null,"cans","PET CSD","PET HF","AF","RB","NRGB","total"]
["P02/Jan (P01 UK)",{"$f":"L2/$R2","v":{"$error":"#DIV/0!"}},{"$f":"M2/$R2","v":{"$error":"#DIV/0!"}},{"$error":"#DIV/0!"},{"$error":"#DIV/0!"},{"$error":"#DIV/0!"},{"$error":"#DIV/0!"},null,null,null,null,{"$f":"SUMIFS('Production data'!$I$4:$I$123,'Production data'!$G$4:$G$123,L$1)","v":0},{"$f":"SUMIFS('Production data'!$I$4:$I$123,'Production data'!$G$4:$G$123,M$1)","v":0},{"$f":"SUMIFS('Production data'!$I$4:$I$123,'Production data'!$G$4:$G$123,N$1)","v":0},{"$f":"SUMIFS('Production data'!$I$4:$I$123,'Production data'!$G$4:$G$123,O$1)","v":0},{"$f":"SUMIFS('Production data'!$I$4:$I$123,'Production data'!$G$4:$G$123,P$1)","v":0},{"$f":"SUMIFS('Production data'!$I$4:$I$123,'Production data'!$G$4:$G$123,Q$1)","v":0},{"$f":"SUM(L2:Q2)","v":0}]
["P03/Feb (P02 UK)",{"$f":"L3/$R3","v":{"$error":"#DIV/0!"}},{"$error":"#DIV/0!"},{"$error":"#DIV/0!"},{"$error":"#DIV/0!"},{"$error":"#DIV/0!"},{"$error":"#DIV/0!"},null,null,null,null,{"$f":"SUMIFS('Production data'!$I$4:$I$123,'Production data'!$G$4:$G$123,L$1)","v":0},{"$f":"SUMIFS('Production data'!$I$4:$I$123,'Production data'!$G$4:$G$123,M$1)","v":0},{"$f":"SUMIFS('Production data'!$I$4:$I$123,'Production data'!$G$4:$G$123,N$1)","v":0},{"$f":"SUMIFS('Production data'!$I$4:$I$123,'Production data'!$G$4:$G$123,O$1)","v":0},{"$f":"SUMIFS('Production data'!$I$4:$I$123,'Production data'!$G$4:$G$123,P$1)","v":0},{"$f":"SUMIFS('Production data'!$I$4:$I$123,'Production data'!$G$4:$G$123,Q$1)","v":0},{"$f":"SUM(L3:Q3)","v":0}]
["P04/Mar (P03 UK)",{"$error":"#DIV/0!"},{"$error":"#DIV/0!"},{"$error":"#DIV/0!"},{"$error":"#DIV/0!"},{"$error":"#DIV/0!"},{"$error":"#DIV/0!"},null,null,null,null,{"$f":"SUMIFS('Production data'!$I$4:$I$123,'Production data'!$G$4:$G$123,L$1)","v":0},{"$f":"SUMIFS('Production data'!$I$4:$I$123,'Production data'!$G$4:$G$123,M$1)","v":0},{"$f":"SUMIFS('Production data'!$I$4:$I$123,'Production data'!$G$4:$G$123,N$1)","v":0},{"$f":"SUMIFS('Production data'!$I$4:$I$123,'Production data'!$G$4:$G$123,O$1)","v":0},{"$f":"SUMIFS('Production data'!$I$4:$I$123,'Production data'!$G$4:$G$123,P$1)","v":0},{"$f":"SUMIFS('Production data'!$I$4:$I$123,'Production data'!$G$4:$G$123,Q$1)","v":0},0]
["P05/Apr (P04 UK)",{"$error":"#DIV/0!"},{"$error":"#DIV/0!"},{"$error":"#DIV/0!"},{"$error":"#DIV/0!"},{"$error":"#DIV/0!"},{"$error":"#DIV/0!"},null,null,null,null,{"$f":"SUMIFS('Production data'!$I$4:$I$123,'Production data'!$G$4:$G$123,L$1)","v":0},{"$f":"SUMIFS('Production data'!$I$4:$I$123,'Production data'!$G$4:$G$123,M$1)","v":0},{"$f":"SUMIFS('Production data'!$I$4:$I$123,'Production data'!$G$4:$G$123,N$1)","v":0},{"$f":"SUMIFS('Production data'!$I$4:$I$123,'Production data'!$G$4:$G$123,O$1)","v":0},{"$f":"SUMIFS('Production data'!$I$4:$I$123,'Production data'!$G$4:$G$123,P$1)","v":0},{"$f":"SUMIFS('Production data'!$I$4:$I$123,'Production data'!$G$4:$G$123,Q$1)","v":0},0]
["P06/May (P05 UK)",{"$error":"#DIV/0!"},{"$error":"#DIV/0!"},{"$error":"#DIV/0!"},{"$error":"#DIV/0!"},{"$error":"#DIV/0!"},{"$error":"#DIV/0!"},null,null,null,null,{"$f":"SUMIFS('Production data'!$I$4:$I$123,'Production data'!$G$4:$G$123,L$1)","v":0},{"$f":"SUMIFS('Production data'!$I$4:$I$123,'Production data'!$G$4:$G$123,M$1)","v":0},{"$f":"SUMIFS('Production data'!$I$4:$I$123,'Production data'!$G$4:$G$123,N$1)","v":0},{"$f":"SUMIFS('Production data'!$I$4:$I$123,'Production data'!$G$4:$G$123,O$1)","v":0},{"$f":"SUMIFS('Production data'!$I$4:$I$123,'Production data'!$G$4:$G$123,P$1)","v":0},{"$f":"SUMIFS('Production data'!$I$4:$I$123,'Production data'!$G$4:$G$123,Q$1)","v":0},0]
["P07/Jun (P06 UK)",{"$error":"#DIV/0!"},{"$error":"#DIV/0!"},{"$error":"#DIV/0!"},{"$error":"#DIV/0!"},{"$error":"#DIV/0!"},{"$error":"#DIV/0!"},null,null,null,null,{"$f":"SUMIFS('Production data'!$I$4:$I$123,'Production data'!$G$4:$G$123,L$1)","v":0},{"$f":"SUMIFS('Production data'!$I$4:$I$123,'Production data'!$G$4:$G$123,M$1)","v":0},{"$f":"SUMIFS('Production data'!$I$4:$I$123,'Production data'!$G$4:$G$123,N$1)","v":0},{"$f":"SUMIFS('Production data'!$I$4:$I$123,'Production data'!$G$4:$G$123,O$1)","v":0},{"$f":"SUMIFS('Production data'!$I$4:$I$123,'Production data'!$G$4:$G$123,P$1)","v":0},{"$f":"SUMIFS('Production data'!$I$4:$I$123,'Production data'!$G$4:$G$123,Q$1)","v":0},0]
["P08/Jul (P07 UK)",{"$error":"#DIV/0!"},{"$error":"#DIV/0!"},{"$error":"#DIV/0!"},{"$error":"#DIV/0!"},{"$error":"#DIV/0!"},{"$error":"#DIV/0!"},null,null,null,null,{"$f":"SUMIFS('Production data'!$I$4:$I$123,'Production data'!$G$4:$G$123,L$1)","v":0},{"$f":"SUMIFS('Production data'!$I$4:$I$123,'Production data'!$G$4:$G$123,M$1)","v":0},{"$f":"SUMIFS('Production data'!$I$4:$I$123,'Production data'!$G$4:$G$123,N$1)","v":0},{"$f":"SUMIFS('Production data'!$I$4:$I$123,'Production data'!$G$4:$G$123,O$1)","v":0},{"$f":"SUMIFS('Production data'!$I$4:$I$123,'Production data'!$G$4:$G$123,P$1)","v":0},{"$f":"SUMIFS('Production data'!$I$4:$I$123,'Production data'!$G$4:$G$123,Q$1)","v":0},0]
["P09/Aug (P08 UK)",{"$error":"#DIV/0!"},{"$error":"#DIV/0!"},{"$error":"#DIV/0!"},{"$error":"#DIV/0!"},{"$error":"#DIV/0!"},{"$error":"#DIV/0!"},null,null,null,null,{"$f":"SUMIFS('Production data'!$I$4:$I$123,'Production data'!$G$4:$G$123,L$1)","v":0},{"$f":"SUMIFS('Production data'!$I$4:$I$123,'Production data'!$G$4:$G$123,M$1)","v":0},{"$f":"SUMIFS('Production data'!$I$4:$I$123,'Production data'!$G$4:$G$123,N$1)","v":0},{"$f":"SUMIFS('Production data'!$I$4:$I$123,'Production data'!$G$4:$G$123,O$1)","v":0},{"$f":"SUMIFS('Production data'!$I$4:$I$123,'Production data'!$G$4:$G$123,P$1)","v":0},{"$f":"SUMIFS('Production data'!$I$4:$I$123,'Production data'!$G$4:$G$123,Q$1)","v":0},0]
["P10/Sep (P09 UK)",{"$error":"#DIV/0!"},{"$error":"#DIV/0!"},{"$error":"#DIV/0!"},{"$error":"#DIV/0!"},{"$error":"#DIV/0!"},{"$error":"#DIV/0!"},null,null,null,null,{"$f":"SUMIFS('Production data'!$I$4:$I$123,'Production data'!$G$4:$G$123,L$1)","v":0},{"$f":"SUMIFS('Production data'!$I$4:$I$123,'Production data'!$G$4:$G$123,M$1)","v":0},{"$f":"SUMIFS('Production data'!$I$4:$I$123,'Production data'!$G$4:$G$123,N$1)","v":0},{"$f":"SUMIFS('Production data'!$I$4:$I$123,'Production data'!$G$4:$G$123,O$1)","v":0},{"$f":"SUMIFS('Production data'!$I$4:$I$123,'Production data'!$G$4:$G$123,P$1)","v":0},{"$f":"SUMIFS('Production data'!$I$4:$I$123,'Production data'!$G$4:$G$123,Q$1)","v":0},0]
{"$rows_left_out":3}
{"sheet":"Non-returnable Lines","index":5,"n_rows":178,"n_cols":17,"rows_kept":178,"cut":false,"hidden":false,"merged":[[2,0,4,0],[2,9,4,9],[0,0,0,7],[0,9,0,16]]}
["PET CSD, HF & AF",null,null,null,null,null,null,null,null,"Cans CSD/NCB"]
[]
["Total","PET CSD",{"$f":"SUMIF(B7:B180,B3,F7:F180)","v":0},null,null,null,null,null,null,"Total","Cans CSD",{"$f":"SUMIF(K7:K180,K3,O7:O180)","v":0}]
[null,"PET AF",{"$f":"SUMIF(B7:B180,B4,F7:F180)","v":0},null,null,null,null,null,null,null,"Cans HF",{"$f":"SUMIF(K7:K180,K4,O7:O180)","v":0}]
[null,"PET HF",{"$f":"SUMIF(B7:B180,B5,F7:F180)","v":0},"Opportunities vs BIC",{"$f":"SUM(H25,H9,H40,H56,H72,H88,H104,H120,H136,H152,H168)","v":0},null,null,null,null,null,"Tetrapak",{"$f":"SUMIF(K7:K180,K5,O7:O180)","v":0},"Opportunities vs BIC",{"$f":"SUM(Q25,Q9,Q40,Q56,Q72,Q88,Q104,Q120,Q136,Q152,Q168)","v":0}]
[]
[null,null,"NE hrs",{"$f":"IFERROR(VLOOKUP(A7,'Production data'!$C$4:$L$206,9,0),\"0\")","v":"0"},"total Lost L",{"$f":"IFERROR(F9*D7,\"\")","v":0},"WU L/L",{"$f":"IFERROR(F9/B8+1,0)","v":0},null,null,null,"NE hrs",{"$f":"IFERROR(VLOOKUP(J7,'Production data'!$C$4:$L$206,9,0),\"0\")","v":"0"},"total Lost L",{"$f":"O9*M7","v":0},"WU L/L",{"$f":"IFERROR(O9/K8+1,0)","v":0}]
["Line capacity L/hr:",{"$f":"IFERROR(VLOOKUP(A7,'Production data'!$C$4:$L$206,10,0),\"0\")","v":"0"},"NE:",{"$f":"IFERROR(VLOOKUP(A7,'Production data'!$C$4:$L$206,8,0),\"0\")","v":"0"},"L/hr recycled","L/hr fresh","BIC","Opportunity",null,"Line capacity L/hr:",{"$f":"IFERROR(VLOOKUP(J7,'Production data'!$C$4:$L$206,10,0),\"0\")","v":"0"},"NE:",{"$f":"IFERROR(VLOOKUP(J7,'Production data'!$C$4:$L$206,8,0),\"0\")","v":"0"},"L/hr recycled","L/hr fresh","BIC","Opportunity"]
["station","water type","comment1","comment2",{"$f":"SUM(E10:E19)","v":0},{"$f":"SUM(F10:F19)","v":0},{"$f":"SUM(G10:G19)","v":0},{"$f":"SUM(H10:H19)*D7","v":0},null,"station","water type","comment1","comment2",{"$f":"SUM(N10:N19)","v":0},{"$f":"SUM(O10:O19)","v":0},{"$f":"SUM(P10:P19)","v":0},{"$f":"SUM(Q10:Q19)*M7","v":0}]
["Rinser",null,null,null,null,null,null,null,null,"Rinser"]
{"$rows_left_out":169}
{"sheet":"Glass Lines","index":6,"n_rows":58,"n_cols":24,"rows_kept":58,"cut":false,"hidden":false,"merged":[[0,0,0,7],[48,10,51,10],[48,11,51,11],[48,12,51,12],[48,13,51,13],[20,10,23,10],[20,11,23,11],[20,12,23,12],[20,13,23,13],[0,9,0,23],[6,10,9,10],[6,11,9,11],[6,12,9,12],[6,13,9,13],[6,14,9,14],[2,0,3,0],[20,9,23,9],[34,9,37,9],[48,9,51,9],[6,9,9,9],[48,14,51,14],[20,14,23,14],[34,10,37,10],[34,11,37,11],[34,12,37,12],[34,13,37,13],[34,14,37,14]]}
["Glass Bottles (RGB/NRGB)",null,null,null,null,null,null,null,null,"Bottle Washer details"]
[]
["Total","RGB",{"$f":"SUMIF(B6:B235,B3,F6:F235)","v":0},"Opportunities vs BIC",{"$f":"SUMIF(B6:B235,B3,I6:I235)","v":0}]
[null,"NRGB",{"$f":"SUMIF(B6:B235,B4,F6:F235)","v":0},"Opportunities vs BIC",{"$f":"SUMIF(B6:B235,B4,I6:I235)","v":0}]
[]
[null,null,"NE hrs",{"$f":"IFERROR(VLOOKUP(A6,'Production data'!$C$4:$L$206,9,0),\"0\")","v":"0"},"Total Lost L",{"$f":"F8*D6","v":0},"WU L/L",{"$f":"IFERROR(F8/B7+1,0)","v":0},{"$f":"H8","v":0},"Bottle Washer details","OEM & year","bottle size (ml)","speed (BPH)","# of pockets per carrier","fresh water auto stop with washer (Y/N)","Zone","Pressure (bar)","# of Sprayers","Nozzle size (mm)","% Fresh water","Source of Water if Recycled","theo. Consumption (OEM) (L/hr)","Actual consumption (L/hr)","comments"]
["Line capacity L/hr:",{"$f":"IFERROR(VLOOKUP(A6,'Production data'!$C$4:$L$206,10,0),\"0\")","v":"0"},"NE:",{"$f":"IFERROR(VLOOKUP(A6,'Production data'!$C$4:$L$206,8,0),\"0\")","v":"0"},"L/hr recycled","L/hr fresh","BIC","opportunity",null,{"$f":"\"Bottle Washer \" &A6","v":"Bottle Washer "},null,null,null,null,null,"Final rinse"]
["Station","water type","comment1","comment2",{"$f":"SUM(E9:E16)","v":0},{"$f":"SUM(F9:F16)","v":0},{"$f":"SUM(G9:G16)","v":0},{"$f":"SUM(H9:H16)*D6","v":0},null,null,null,null,null,null,null,"Prefinal"]
["Bottle Washer",null,null,null,null,null,null,null,null,null,null,null,null,null,null,"Warm rinse"]
["Filler Cleaning",null,null,null,null,null,null,null,null,null,null,null,null,null,null,"pre-rinse"]
{"$rows_left_out":49}
{"sheet":"CIP","index":7,"n_rows":65,"n_cols":16,"rows_kept":65,"cut":false,"hidden":false,"merged":[[0,0,0,15],[8,0,9,0],[32,0,33,0]]}
["Lines & Tanks Sanitation - Monthly"]
[]
["CIP","L/month","L/year","Opportunity",null,"TIP:",null,null,null,null,null,null,null,"days/month","months/year"]
["Lines",{"$f":"N10","v":0},{"$f":"B4*O4","v":0},{"$f":"P30","v":0},null,"Please add the water that being wasted to drain per CIP. "]
["Tanks",{"$f":"N34","v":0},{"$f":"B5*O4","v":0},{"$f":"P65","v":0},null,"Reclaimed steps to other application should NOT be considered"]
["Total CIPs",{"$f":"B5+B4","v":0},{"$f":"SUM(C4:C5)","v":0},{"$f":"SUM(D4:D5)","v":0},null,"Closed loop streams should NOT be considered"]
[null,null,null,null,null,"The above data should be based on actual full month"]
[]
["Lines","Rinse",null,null,"3 Steps",null,null,"5 steps",null,null,"7 steps",null,null,"Total lines","Cat.3/4 extension","Opportunity"]
[null,"#/month","L/rinse","L/Month","#/month","L/3S","L/Month","#/month","L/5S","L/Month","#/month","L/5S","L/Month",{"$f":"SUM(N11:N29)","v":0},"hrs"]
{"$rows_left_out":56}
{"sheet":"Utilities +WTP","index":8,"n_rows":73,"n_cols":16,"rows_kept":73,"cut":false,"hidden":false,"merged":[[0,0,0,15],[50,0,72,0],[50,1,50,14],[65,1,65,15],[34,0,34,11],[25,0,25,10]]}
["Admin, Utilities & WTP - Monthly"]
[]
["Utilities + projects","L/day","L/month","L/Year","Opportunity",null,null,null,null,null,"days/month","months/year"]
["Boiler & Steam network",{"$f":"IFERROR(C4/K4,0)","v":0},{"$f":"I32","v":0},{"$f":"C4*L4","v":0},{"$f":"K32","v":0}]
["Admin & Others",{"$f":"IFERROR(C5/K5,0)","v":0},{"$f":"D24","v":0},{"$f":"C5*L5","v":0},{"$f":"F24","v":0}]
["Cooling towers",{"$f":"IFERROR(C6/K6, 0)","v":0},{"$f":"I47","v":0},{"$f":"C6*L6","v":0},{"$f":"L47","v":0}]
["WTP Filters",{"$f":"IFERROR(C7/K7,0)","v":0},{"$f":"M64","v":0},{"$f":"C7*L7","v":0},{"$f":"O64","v":0}]
["WTP RO",{"$f":"IFERROR(C8/K8, 0)","v":0},{"$f":"N73","v":0},{"$f":"C8*L8","v":0},{"$f":"P73","v":0}]
["Projects"]
[]
{"$rows_left_out":64}
{"sheet":"Water Balance","index":9,"n_rows":58,"n_cols":30,"rows_kept":58,"cut":false,"hidden":false,"merged":[[14,26,16,27],[10,29,11,31],[3,29,3,31],[8,29,8,31],[9,29,9,31],[4,29,6,31],[3,26,3,27],[4,26,6,27],[8,26,8,27],[9,26,11,27],[13,26,13,27]]}
[]
[]
[]
[null,null,null,null,null,null,null,null,null,null,null,null,null,null,null,null,null,null,null,null,null,null,null,null,null,null,"Total Incoming",null,null,"Water Capex $m"]
[null,null,null,null,null,null,null,null,null,null,null,null,null,null,null,null,null,null,null,null,null,null,null,null,null,null,{"$f":"N57+N58","v":0}]
[]
[]
[]
[null,null,null,null,null,null,null,null,null,null,null,null,null,null,null,null,null,null,null,null,null,null,null,null,null,null,"Total Outgoing",null,null,"Water Storage"]
[null,null,null,null,null,null,null,null,null,null,null,null,null,null,null,null,null,null,null,null,null,null,null,null,null,null,{"$f":"SUM(N55,N49,N54)","v":0}]
{"$rows_left_out":49}
{"sheet":"Output-Tier 1&2","index":10,"n_rows":57,"n_cols":9,"rows_kept":57,"cut":false,"hidden":false,"merged":[[0,1,0,8]]}
[null,"The Below data is based on Peak full month "]
[null,null,"Losses in Liters","% weight","Losses in $","Losses L/L","Opportunity (L)","Opportunity ($)","Saving in L/L"]
[null,"Total",{"$f":"SUM(C4,C9,C13,C16,C17)","v":0},{"$f":"SUM(D4,D9,D13,D16,D17)","v":0},{"$f":"SUM(E4,E9,E13,E16,E17)","v":0},{"$f":"IFERROR(C3/$E$21,\"\")","v":""},{"$f":"SUM(G4,G9,G13,G16,G17)","v":0},{"$f":"SUM(H4,H9,H13,H16,H17)","v":0},{"$f":"IFERROR(SUM(I4,I9,I13,I16),0)","v":0}]
[null,"Production lines",{"$f":"SUM(C5:C8)","v":0},{"$f":"IFERROR(C4/$C$3,\"\")","v":""},{"$f":"C4*$H$21/1000","v":0},"",{"$f":"SUM(G5:G8)","v":0},{"$f":"(G4*$H$21)/1000","v":0},{"$f":"IFERROR(G4/$E$21,0)","v":0}]
[null,"RGB",{"$f":"'Glass Lines'!C3","v":0},"",{"$f":"(C5*$H$21)/1000","v":0},"",{"$f":"'Glass Lines'!E3","v":0},{"$f":"(G5*$H$21)/1000","v":0},0]
[null,"Cans/Tetra",{"$f":"SUM('Non-returnable Lines'!L3:L5)","v":0},"",{"$f":"(C6*$H$21)/1000","v":0},"",{"$f":"'Non-returnable Lines'!N5","v":0},{"$f":"(G6*$H$21)/1000","v":0},0]
[null,"PET (CSD/HF/AF)",{"$f":"SUM('Non-returnable Lines'!C3:C5)","v":0},"",{"$f":"(C7*$H$21)/1000","v":0},"",{"$f":"'Non-returnable Lines'!E5","v":0},{"$f":"(G7*$H$21)/1000","v":0},0]
[null,"NRGB",{"$f":"'Glass Lines'!C4","v":0},"",{"$f":"(C8*$H$21)/1000","v":0},"",{"$f":"'Glass Lines'!E4","v":0},{"$f":"(G8*$H$21)/1000","v":0},0]
[null,"Utilities",{"$f":"SUM(C10:C12)","v":0},"",{"$f":"C9*$H$21","v":0},"",{"$f":"SUM(G10:G12)","v":0},{"$f":"G9*$H$21","v":0},0]
[null,"Boiler & Steam network",{"$f":"'Utilities +WTP'!C4","v":0},"",{"$f":"(C10*$H$21)/1000","v":0},"",{"$f":"'Utilities +WTP'!E4","v":0},{"$f":"(G10*$H$21)/1000","v":0},0]
{"$rows_left_out":48}
{"sheet":"Cans","index":11,"n_rows":236,"n_cols":6,"rows_kept":236,"cut":false,"hidden":true,"merged":[[0,0,0,5]]}
["Cans CSD"]
[null,null,null,null,"TE:"]
[null,null,null,null,"NE:"]
["Line name:","Cans1","Line capacity L/hr:",{"$f":"36000*0.35","v":12600},"WU L/L",{"$f":"F15/D4+1","v":1.6944444444444444}]
["station","water type",null,null,"L/hr recycled","L/hr fresh"]
["Rinser","fresh","# of nozzles","Nozzle size",null,8000]
["Filler Cleaning",null,"hose size","Guns/hoses?",null,{"$f":"3000/20","v":150}]
["Filler Rollers lub","recycled",null,"auto stop?",null,500]
["Seamer sanitation","fresh","time/freq?","auto/manual"]
["Warmer",null,null,"dew point ctrl?"]
{"$rows_left_out":227}
{"sheet":"AWS requirement","index":12,"n_rows":20,"n_cols":22,"rows_kept":20,"cut":false,"hidden":true,"merged":[[13,21,13,22],[14,21,14,22],[16,21,16,22],[17,21,17,22],[0,1,0,18],[5,17,7,18],[10,17,12,18],[15,17,17,18],[4,17,4,18],[9,17,9,18],[14,17,14,18]]}
[null,"Facility Water Balance (m3)"]
[]
[]
[null,null,null,null,null,null,null,null,null,null,null,null,null,null,null,{"$f":"('Utilities +WTP'!H32+'Utilities +WTP'!J47)/1000","v":0}]
[null,null,null,null,null,null,null,null,null,null,null,null,null,null,null,null,null,"Total Incoming"]
[null,null,null,null,null,null,null,null,null,null,null,null,null,null,null,null,null,{"$f":"SUM(B13,B10)","v":0}]
[]
[null,null,null,null,null,null,null,null,null,null,null,null,null,null,null,{"$f":"'Output-Tier 1&2'!$E$21/1000","v":0}]
[]
[null,{"$f":"'Incoming water'!D19","v":0},null,null,null,null,"Tanks",null,null,null,null,null,null,null,null,null,null,"Total Outgoing"]
{"$rows_left_out":10}